Reaction Details
TargetDiacylglycerol O-acyltransferase 2
LigandBDBM215552
Substrate/Competitorn/a
Meas. Tech.DGAT2 Cell-Based Assay
IC50 5.5±n/a nM
Citation Ahn, KBoehm, MCabral, SCarpino, PAFutatsugi, KHepworth, DKung, DWOrr, SWang, J Diacylglycerol acyltransferase 2 inhibitors US Patent US9296745 Publication Date 3/29/2016
 
Diacylglycerol O-acyltransferase 2
Name:Diacylglycerol O-acyltransferase 2
Type:Multi-pass membrane protein
Mol. Mass.:43848.90
Organism:Homo sapiens (Human)
Description:Q96PD7
Residue:388
BDBM215552
NameBDBM215552
Synonyms:US9296745, 109-A US9296745, 190
TypeSmall organic molecule
Emp. Form.C22H26ClN7O
Mol. Mass.439.941
SMILESClc1cnn(c1)C1(CC1)c1nc2ccc(nc2[nH]1)N1CCC[C@H](C1)C(=O)N1CCCC1