Reaction Details
TargetNicotinamide phosphoribosyltransferase
LigandBDBM215825
Substrate/Competitorn/a
Meas. Tech.Time-Resolved Fluorescence Resonance Energy Transfer (TR-FRET) Binding Assay
pH7.5±n/a
IC50 11±n/a nM
Commentsextracted
Citation Curtin, MLSorensen, BKHeyman, HRClark, RFWoller, KRShah, OJMichaelides, MTse, CVasudevan, AMack, HHansen, TMSweis, RPliushchev, MA NAMPT and rock inhibitors US Patent US9302989 Publication Date 4/5/2016
 
Nicotinamide phosphoribosyltransferase
Name:Nicotinamide phosphoribosyltransferase
Type:Enzyme
Mol. Mass.:55524.98
Organism:Homo sapiens (Human)
Description:P43490
Residue:491
BDBM215825
NameBDBM215825
Synonyms:US9302989, 20
TypeSmall organic molecule
Emp. Form.C21H24FN3O2
Mol. Mass.369.4326
SMILESCC(C)CCNC(=O)c1ccc(NC(=O)N2Cc3ccc(F)cc3C2)cc1