Reaction Details
TargetNicotinamide phosphoribosyltransferase
LigandBDBM216345
Substrate/Competitorn/a
Meas. Tech.Time-Resolved Fluorescence Resonance Energy Transfer (TR-FRET) Binding Assay
pH7.5±n/a
IC50 10.4±n/a nM
Commentsextracted
Citation Curtin, MLSorensen, BKHeyman, HRClark, RFWoller, KRShah, OJMichaelides, MTse, CVasudevan, AMack, HHansen, TMSweis, RPliushchev, MA NAMPT and rock inhibitors US Patent US9302989 Publication Date 4/5/2016
 
Nicotinamide phosphoribosyltransferase
Name:Nicotinamide phosphoribosyltransferase
Type:Enzyme
Mol. Mass.:55524.98
Organism:Homo sapiens (Human)
Description:P43490
Residue:491
BDBM216345
NameBDBM216345
Synonyms:US9302989, 290
TypeSmall organic molecule
Emp. Form.C20H24N4O2
Mol. Mass.352.4302
SMILESCC(C)CCNC(=O)c1ccc(NC(=O)N2Cc3ccncc3C2)cc1