Reaction Details
TargetNicotinamide phosphoribosyltransferase
LigandBDBM217096
Substrate/Competitorn/a
Meas. Tech.Time-Resolved Fluorescence Resonance Energy Transfer (TR-FRET) Binding Assay
pH7.5±n/a
IC50 46.5±n/a nM
Commentsextracted
Citation Curtin, MLSorensen, BKHeyman, HRClark, RFWoller, KRShah, OJMichaelides, MTse, CVasudevan, AMack, HHansen, TMSweis, RPliushchev, MA NAMPT and rock inhibitors US Patent US9302989 Publication Date 4/5/2016
 
Nicotinamide phosphoribosyltransferase
Name:Nicotinamide phosphoribosyltransferase
Type:Enzyme
Mol. Mass.:55524.98
Organism:Homo sapiens (Human)
Description:P43490
Residue:491
BDBM217096
NameBDBM217096
Synonyms:US9302989, 391
TypeSmall organic molecule
Emp. Form.C30H31N5O2
Mol. Mass.493.5994
SMILESCN1CCN(Cc2ccc3CN(Cc3c2)C(=O)Nc2ccc(cc2)-c2c[nH]c(=O)c3ccccc23)CC1