Reaction Details
TargetSodium-dependent dopamine transporter
LigandBDBM172726
Substrate/Competitorn/a
Meas. Tech.Radioligand Binding Assay
Ki 0.91±n/a nM
Citation Bhat, LBhat, S Cycloalkylmethylamines US Patent US9296681 Publication Date 3/29/2016
 
Sodium-dependent dopamine transporter
Name:Sodium-dependent dopamine transporter
Type:Multi-pass membrane protein
Mol. Mass.:68497.11
Organism:Homo sapiens (Human)
Description:Q01959
Residue:620
BDBM172726
NameBDBM172726
Synonyms:US9096515, 33a -(R)-Isomer | US9296681, 33a-(R)-Isomer
TypeSmall organic molecule
Emp. Form.C19H28Cl2N2O
Mol. Mass.371.344
SMILESC[C@@H](CCNCCCC(N)=O)CC1(CCC1)c1ccc(Cl)c(Cl)c1