Reaction Details
TargetGag-Pol polyprotein
LigandBDBM2483
Substrate/Competitorn/a
Meas. Tech.DNA Polymerase Assay
pH8.1±n/a
IC50 25± 5 nM
Commentsextracted
Citation Martini, REsposito, FCorona, AFerrarese, RCeresola, ERVisconti, LTintori, CBarbieri, ACalcaterra, AIovine, VCanducci, FTramontano, EBotta, M Natural Product Kuwanon-L Inhibits HIV-1 Replication through Multiple Target Binding. Chembiochem18:374-377 (2017) 
 
Gag-Pol polyprotein
Name:Gag-Pol polyprotein
Type:Protein
Mol. Mass.:162074.74
Organism:Human immunodeficiency virus type 1 group M subtype B (isolate HXB2)
Description:P04585
Residue:1435
BDBM2483
NameBDBM2483
Synonyms:(4S)-6-chloro-4-(2-cyclopropylethynyl)-4-(trifluoromethyl)-2,4-dihydro-1H-3,1-benzoxazin-2-one DMP-266 Efavirenz L-743,726 | Sustiva
TypeSmall organic molecule
Emp. Form.C14H9ClF3NO2
Mol. Mass.315.675
SMILESFC(F)(F)[C@]1(OC(=O)Nc2ccc(Cl)cc12)C#CC1CC1