Reaction Details
TargetOpioid growth factor receptor-like protein 1
LigandBDBM220357
Substrate/Competitorn/a
Meas. Tech.In Vitro ORL-1 Receptor Functional Assay
pH7.4±n/a
Temperature298.15±n/a K
EC50 42.5±4.8 nM
Commentsextracted
Citation Tafesse, LTsuno, NZhou, X Azetidine-substituted quinoxalines as opioid receptor like-1 modulators US Patent US9290488 Publication Date 3/22/2016
 
Opioid growth factor receptor-like protein 1
Name:Opioid growth factor receptor-like protein 1
Type:Protein
Mol. Mass.:51247.53
Organism:Homo sapiens (Human)
Description:Q5TC84
Residue:451
BDBM220357
NameBDBM220357
Synonyms:US9290488, A11a(ii)
TypeSmall organic molecule
Emp. Form.C29H38N4O3
Mol. Mass.490.637
SMILESC[C@H]1C[C@H]2C[C@@H](C1)C[C@@H](C2)N1[C@H]2CC[C@@H]1C[C@@H](C2)n1c2ccccc2nc(N2CC[C@H]2C(O)=O)c1=O