Reaction Details
TargetOpioid growth factor receptor-like protein 1
LigandBDBM220372
Substrate/Competitorn/a
Meas. Tech.In Vitro ORL-1 Receptor Functional Assay
pH7.4±n/a
Temperature298.15±n/a K
EC50 129.7±4.7 nM
Commentsextracted
Citation Tafesse, LTsuno, NZhou, X Azetidine-substituted quinoxalines as opioid receptor like-1 modulators US Patent US9290488 Publication Date 3/22/2016
 
Opioid growth factor receptor-like protein 1
Name:Opioid growth factor receptor-like protein 1
Type:Protein
Mol. Mass.:51247.53
Organism:Homo sapiens (Human)
Description:Q5TC84
Residue:451
BDBM220372
NameBDBM220372
Synonyms:US9290488, E53a(ii)
TypeSmall organic molecule
Emp. Form.C31H42N4O3
Mol. Mass.518.6902
SMILESCC1(C)[C@@H]2C[C@H]1[C@H](CCN1[C@H]3CCC[C@@H]1C[C@@H](C3)n1c3ccccc3nc(N3CC[C@H]3C(O)=O)c1=O)CC2