Reaction Details
TargetOpioid growth factor receptor-like protein 1
LigandBDBM220374
Substrate/Competitorn/a
Meas. Tech.In Vitro ORL-1 Receptor Functional Assay
pH7.4±n/a
Temperature298.15±n/a K
EC50 40.1±3.8 nM
Commentsextracted
Citation Tafesse, LTsuno, NZhou, X Azetidine-substituted quinoxalines as opioid receptor like-1 modulators US Patent US9290488 Publication Date 3/22/2016
 
Opioid growth factor receptor-like protein 1
Name:Opioid growth factor receptor-like protein 1
Type:Protein
Mol. Mass.:51247.53
Organism:Homo sapiens (Human)
Description:Q5TC84
Residue:451
BDBM220374
NameBDBM220374
Synonyms:US9290488, H3a
TypeSmall organic molecule
Emp. Form.C30H42N4O3
Mol. Mass.506.6795
SMILESOC(=O)C1CN(C1)c1nc2ccccc2n([C@@H]2C[C@@H]3CCC[C@H](C2)N3C2CCCCCCCCC2)c1=O