Reaction Details
TargetOpioid growth factor receptor-like protein 1
LigandBDBM220377
Substrate/Competitorn/a
Meas. Tech.In Vitro ORL-1 Receptor Functional Assay
pH7.4±n/a
Temperature298.15±n/a K
EC50 14.6±1.2 nM
Commentsextracted
Citation Tafesse, LTsuno, NZhou, X Azetidine-substituted quinoxalines as opioid receptor like-1 modulators US Patent US9290488 Publication Date 3/22/2016
 
Opioid growth factor receptor-like protein 1
Name:Opioid growth factor receptor-like protein 1
Type:Protein
Mol. Mass.:51247.53
Organism:Homo sapiens (Human)
Description:Q5TC84
Residue:451
BDBM220377
NameBDBM220377
Synonyms:US9290488, L2b(i)
TypeSmall organic molecule
Emp. Form.C30H40N4O3
Mol. Mass.504.6636
SMILESOC(=O)[C@H]1CCN1c1nc2ccccc2n([C@@H]2C[C@@H]3CCC[C@H](C2)N3[C@H]2C[C@@H]3C[C@H](C2)CCCC3)c1=O