Reaction Details
TargetOpioid growth factor receptor-like protein 1
LigandBDBM220380
Substrate/Competitorn/a
Meas. Tech.In Vitro ORL-1 Receptor Functional Assay
pH7.4±n/a
Temperature298.15±n/a K
EC50>20000±n/a nM
Commentsextracted
Citation Tafesse, LTsuno, NZhou, X Azetidine-substituted quinoxalines as opioid receptor like-1 modulators US Patent US9290488 Publication Date 3/22/2016
 
Opioid growth factor receptor-like protein 1
Name:Opioid growth factor receptor-like protein 1
Type:Protein
Mol. Mass.:51247.53
Organism:Homo sapiens (Human)
Description:Q5TC84
Residue:451
BDBM220380
NameBDBM220380
Synonyms:US9290488, ZA01
TypeSmall organic molecule
Emp. Form.C30H41N5O3
Mol. Mass.519.6782
SMILESNC1(CN(C1)c1nc2ccccc2n([C@@H]2C[C@@H]3CCC[C@H](C2)N3[C@H]2C[C@@H]3C[C@H](C2)CCCC3)c1=O)C(O)=O