Reaction Details
TargetOpioid growth factor receptor-like protein 1
LigandBDBM220381
Substrate/Competitorn/a
Meas. Tech.In Vitro ORL-1 Receptor Functional Assay
pH7.4±n/a
Temperature298.15±n/a K
EC50 24.2±4.2 nM
Commentsextracted
Citation Tafesse, LTsuno, NZhou, X Azetidine-substituted quinoxalines as opioid receptor like-1 modulators US Patent US9290488 Publication Date 3/22/2016
 
Opioid growth factor receptor-like protein 1
Name:Opioid growth factor receptor-like protein 1
Type:Protein
Mol. Mass.:51247.53
Organism:Homo sapiens (Human)
Description:Q5TC84
Residue:451
BDBM220381
NameBDBM220381
Synonyms:US9290488, ZA02
TypeSmall organic molecule
Emp. Form.C32H43N5O4
Mol. Mass.561.7149
SMILESCC(=O)N[C@@H]1CN([C@@H]1C(O)=O)c1nc2ccccc2n([C@@H]2C[C@@H]3CCC[C@H](C2)N3[C@H]2C[C@@H]3C[C@H](C2)CCCC3)c1=O