Reaction Details
TargetOpioid growth factor receptor-like protein 1
LigandBDBM220387
Substrate/Competitorn/a
Meas. Tech.In Vitro ORL-1 Receptor Functional Assay
pH7.4±n/a
Temperature298.15±n/a K
EC50 29.3±3.9 nM
Commentsextracted
Citation Tafesse, LTsuno, NZhou, X Azetidine-substituted quinoxalines as opioid receptor like-1 modulators US Patent US9290488 Publication Date 3/22/2016
 
Opioid growth factor receptor-like protein 1
Name:Opioid growth factor receptor-like protein 1
Type:Protein
Mol. Mass.:51247.53
Organism:Homo sapiens (Human)
Description:Q5TC84
Residue:451
BDBM220387
NameBDBM220387
Synonyms:US9290488, ZA08
TypeSmall organic molecule
Emp. Form.C30H40N4O4
Mol. Mass.520.663
SMILESCO[C@H]1CN([C@@H]1C(O)=O)c1nc2ccccc2n([C@@H]2C[C@@H]3CCC[C@H](C2)N3[C@@H]2C[C@H]3CCC[C@H](C3)C2)c1=O