Reaction Details
TargetBromodomain-containing protein 4 [57-168]
LigandBDBM220516
Substrate/Competitorn/a
Meas. Tech.Bromodomain Domain Binding Assay
pH6±n/a
Temperature298.15±n/a K
Ki 0.52±n/a nM
Commentsextracted
Citation Wang, LPratt, JKMcDaniel, KFDai, YFidanze, SDHasvold, LHolms, JHKati, WMLiu, DMantei, RAMcClellan, WJSheppard, GSWada, CK Bromodomain inhibitors US Patent US9296741 Publication Date 3/29/2016
 
Bromodomain-containing protein 4 [57-168]
Name:Bromodomain-containing protein 4 [57-168]
Type:Enzyme Catalytic Domain
Mol. Mass.:13496.03
Organism:Homo sapiens (Human)
Description:BDI: amino acids K57-E168
Residue:112
BDBM220516
NameBDBM220516
Synonyms:US9296741, 105
TypeSmall organic molecule
Emp. Form.C21H25N3O5S
Mol. Mass.431.505
SMILESCCS(=O)(=O)Nc1ccc(OC2CCCOC2)c(c1)-c1cn(C)c(=O)c2[nH]ccc12