Reaction Details
TargetBromodomain-containing protein 4 [57-168]
LigandBDBM220649
Substrate/Competitorn/a
Meas. Tech.Bromodomain Domain Binding Assay
pH6±n/a
Temperature298.15±n/a K
Ki 1.1±n/a nM
Commentsextracted
Citation Wang, LPratt, JKMcDaniel, KFDai, YFidanze, SDHasvold, LHolms, JHKati, WMLiu, DMantei, RAMcClellan, WJSheppard, GSWada, CK Bromodomain inhibitors US Patent US9296741 Publication Date 3/29/2016
 
Bromodomain-containing protein 4 [57-168]
Name:Bromodomain-containing protein 4 [57-168]
Type:Enzyme Catalytic Domain
Mol. Mass.:13496.03
Organism:Homo sapiens (Human)
Description:BDI: amino acids K57-E168
Residue:112
BDBM220649
NameBDBM220649
Synonyms:US9296741, 238
TypeSmall organic molecule
Emp. Form.C18H20N4O3S
Mol. Mass.372.441
SMILESCn1cc(-c2cc(ccc2NCC2CC2)S(N)(=O)=O)c2cc[nH]c2c1=O