Reaction Details
TargetBromodomain-containing protein 4 [57-168]
LigandBDBM220735
Substrate/Competitorn/a
Meas. Tech.Bromodomain Domain Binding Assay
pH6±n/a
Temperature298.15±n/a K
Ki 3.2±n/a nM
Commentsextracted
Citation Wang, LPratt, JKMcDaniel, KFDai, YFidanze, SDHasvold, LHolms, JHKati, WMLiu, DMantei, RAMcClellan, WJSheppard, GSWada, CK Bromodomain inhibitors US Patent US9296741 Publication Date 3/29/2016
 
Bromodomain-containing protein 4 [57-168]
Name:Bromodomain-containing protein 4 [57-168]
Type:Enzyme Catalytic Domain
Mol. Mass.:13496.03
Organism:Homo sapiens (Human)
Description:BDI: amino acids K57-E168
Residue:112
BDBM220735
NameBDBM220735
Synonyms:US9296741, 324
TypeSmall organic molecule
Emp. Form.C23H18F2N4O4S
Mol. Mass.484.475
SMILESCCS(=O)(=O)Nc1cc(c(Oc2ccc(F)cc2F)cc1C#N)-c1cn(C)c(=O)c2[nH]ccc12