Reaction Details
TargetBromodomain-containing protein 4 [352-457]
LigandBDBM220484
Substrate/Competitorn/a
Meas. Tech.Bromodomain Domain Binding Assay
pH6±n/a
Temperature298.15±n/a K
Ki 0.5±n/a nM
Commentsextracted
Citation Wang, LPratt, JKMcDaniel, KFDai, YFidanze, SDHasvold, LHolms, JHKati, WMLiu, DMantei, RAMcClellan, WJSheppard, GSWada, CK Bromodomain inhibitors US Patent US9296741 Publication Date 3/29/2016
 
Bromodomain-containing protein 4 [352-457]
Name:Bromodomain-containing protein 4 [352-457]
Type:Enzyme Catalytic Domain
Mol. Mass.:12432.37
Organism:Homo sapiens (Human)
Description:BDII: amino acid E352-M457
Residue:106
BDBM220484
NameBDBM220484
Synonyms:US9296741, 73
TypeSmall organic molecule
Emp. Form.C22H20N4O5S
Mol. Mass.452.483
SMILESCn1cc(-c2cc(NS(C)(=O)=O)ccc2Oc2ccccc2)c2cc([nH]c2c1=O)C(N)=O