Reaction Details
TargetBromodomain-containing protein 4 [352-457]
LigandBDBM220626
Substrate/Competitorn/a
Meas. Tech.Bromodomain Domain Binding Assay
pH6±n/a
Temperature298.15±n/a K
Ki 0.46±n/a nM
Commentsextracted
Citation Wang, LPratt, JKMcDaniel, KFDai, YFidanze, SDHasvold, LHolms, JHKati, WMLiu, DMantei, RAMcClellan, WJSheppard, GSWada, CK Bromodomain inhibitors US Patent US9296741 Publication Date 3/29/2016
 
Bromodomain-containing protein 4 [352-457]
Name:Bromodomain-containing protein 4 [352-457]
Type:Enzyme Catalytic Domain
Mol. Mass.:12432.37
Organism:Homo sapiens (Human)
Description:BDII: amino acid E352-M457
Residue:106
BDBM220626
NameBDBM220626
Synonyms:US9296741, 215
TypeSmall organic molecule
Emp. Form.C21H24N2O4S
Mol. Mass.400.491
SMILESCn1cc(-c2cc(ccc2OC2CCCCC2)S(C)(=O)=O)c2cc[nH]c2c1=O