Reaction Details
TargetArginase-2, mitochondrial
LigandBDBM290386
Substrate/Competitorn/a
Meas. Tech.Inhibition Assay of Arginase
pH7.4±n/a
Temperature298.15±n/a K
IC50 625±n/a nM
Commentsextracted
Citation Van Zandt, MJagdmann, GE Arginase inhibitors as therapeutics US Patent US10098902 Publication Date 10/16/2018
 
Arginase-2, mitochondrial
Name:Arginase-2, mitochondrial
Type:PROTEIN
Mol. Mass.:38576.93
Organism:Homo sapiens (Human)
Description:ChEMBL_978892
Residue:354
BDBM290386
NameBDBM290386
Synonyms:(3R,4S)-3-amino-4-(3-boronopropyl)-1-(3-(4- chlorophenyl)propyl)pyrrolidine-3-carboxylic acid US10603330, Example 22 | US11389464, Example 22
TypeSmall organic molecule
Emp. Form.C17H26BClN2O4
Mol. Mass.368.663
SMILESN[C@]1(CN(CCCc2ccc(Cl)cc2)C[C@@H]1CCCB(O)O)C(O)=O