Reaction Details
TargetArginase-2, mitochondrial
LigandBDBM290388
Substrate/Competitorn/a
Meas. Tech.Inhibition Assay of Arginase
pH7.4±n/a
Temperature298.15±n/a K
IC50<250±n/a nM
Commentsextracted
Citation Van Zandt, MJagdmann, GE Arginase inhibitors as therapeutics US Patent US10098902 Publication Date 10/16/2018
 
Arginase-2, mitochondrial
Name:Arginase-2, mitochondrial
Type:PROTEIN
Mol. Mass.:38576.93
Organism:Homo sapiens (Human)
Description:ChEMBL_978892
Residue:354
BDBM290388
NameBDBM290388
Synonyms:(3R,4S)-3-amino-1-(2-aminoethyl)-4-(3-boronopropyl)pyrrolidine- 3-carboxylic acid US10603330, Example 24 | US11389464, Example 24
TypeSmall organic molecule
Emp. Form.C10H22BN3O4
Mol. Mass.259.11
SMILESNCCN1C[C@H](CCCB(O)O)[C@@](N)(C1)C(O)=O