Reaction Details
TargetArginase-2, mitochondrial
LigandBDBM290427
Substrate/Competitorn/a
Meas. Tech.Inhibition Assay of Arginase
pH7.4±n/a
Temperature298.15±n/a K
IC50<250±n/a nM
Commentsextracted
Citation Van Zandt, MJagdmann, GE Arginase inhibitors as therapeutics US Patent US10098902 Publication Date 10/16/2018
 
Arginase-2, mitochondrial
Name:Arginase-2, mitochondrial
Type:PROTEIN
Mol. Mass.:38576.93
Organism:Homo sapiens (Human)
Description:ChEMBL_978892
Residue:354
BDBM290427
NameBDBM290427
Synonyms:(1S,2S,4S)-1-amino-2-(3-boronopropyl)-4- (dimethylamino)cyclopentanecarboxylic acid US10603330, Example 63 | US11389464, Example 63
TypeSmall organic molecule
Emp. Form.C11H23BN2O4
Mol. Mass.258.122
SMILESCN(C)[C@H]1C[C@H](CCCB(O)O)[C@@](N)(C1)C(O)=O