Reaction Details
TargetDiacylglycerol O-acyltransferase 1
LigandBDBM221020
Substrate/Competitorn/a
Meas. Tech.DGAT1 Inhibitory Assay
pH7.4±n/a
Temperature303.15±n/a K
IC50 1±n/a nM
Commentsextracted
Citation Sakurai, OSaruta, KHayashi, NGoi, TMorokuma, KTsujishima, HSawamoto, HShitama, HImashiro, R Continuous arycyclic compound US Patent US9302996 Publication Date 4/5/2016
 
Diacylglycerol O-acyltransferase 1
Name:Diacylglycerol O-acyltransferase 1
Type:Protein
Mol. Mass.:55297.82
Organism:Homo sapiens (Human)
Description:O75907
Residue:488
BDBM221020
NameBDBM221020
Synonyms:US9302996, 135
TypeSmall organic molecule
Emp. Form.C21H18ClF5N4O3
Mol. Mass.504.838
SMILESCc1cc(OCC(C)(C)C(O)=O)ncc1-c1cnc(-c2ncc([nH]2)C(F)(F)C(F)(F)F)c(Cl)c1