Reaction Details
TargetDiacylglycerol O-acyltransferase 1
LigandBDBM220947
Substrate/Competitorn/a
Meas. Tech.DGAT1 Inhibitory Assay
pH7.4±n/a
Temperature303.15±n/a K
IC50 0.96±n/a nM
Commentsextracted
Citation Sakurai, OSaruta, KHayashi, NGoi, TMorokuma, KTsujishima, HSawamoto, HShitama, HImashiro, R Continuous arycyclic compound US Patent US9302996 Publication Date 4/5/2016
 
Diacylglycerol O-acyltransferase 1
Name:Diacylglycerol O-acyltransferase 1
Type:Protein
Mol. Mass.:55297.82
Organism:Homo sapiens (Human)
Description:O75907
Residue:488
BDBM220947
NameBDBM220947
Synonyms:US9302996, 62-3
TypeSmall organic molecule
Emp. Form.C21H19F4N3O3
Mol. Mass.437.3875
SMILESCc1cc(OCC(C)(C)C(O)=O)ncc1-c1ccc(-c2nc(c[nH]2)C(F)(F)F)c(F)c1