Reaction Details
TargetOligo-1,6-glucosidase IMA1
LigandBDBM222068
Substrate/Competitorn/a
Meas. Tech.Baker's Yeast α-Glucosidase Inhibition Assay
pH6.8±n/a
Temperature310.15±n/a K
IC50 1.1726e+5± 4.4e+2 nM
Commentsextracted
Citation Zawawi, NKTaha, MAhmat, NIsmail, NHWadood, ARahim, F Synthesis, molecular docking studies of hybrid benzimidazole as a-glucosidase inhibitor. Bioorg Chem70:184-191 (2017) 
 
Oligo-1,6-glucosidase IMA1
Name:Oligo-1,6-glucosidase IMA1
Type:Protein
Mol. Mass.:68577.59
Organism:Saccharomyces cerevisiae S288c (Baker's yeast)
Description:n/a
Residue:589
BDBM222068
NameBDBM222068
Synonyms:2-(4-(5,6-Dimethyl-1H-benzo[d]imidazol-2-yl)benzoyl)-N-(3-nitrophenyl)hydrazinecarbothioamide (9)
TypeSmall organic molecule
Emp. Form.C23H20N6O3S
Mol. Mass.460.508
SMILESCc1cc2nc([nH]c2cc1C)-c1ccc(cc1)C(=O)NNC(=S)Nc1cccc(c1)[N+]([O-])=O