Reaction Details
TargetOligo-1,6-glucosidase IMA1
LigandBDBM222072
Substrate/Competitorn/a
Meas. Tech.Baker's Yeast α-Glucosidase Inhibition Assay
pH6.8±n/a
Temperature310.15±n/a K
IC50 3.0525e+5± 1.19e+3 nM
Commentsextracted
Citation Zawawi, NKTaha, MAhmat, NIsmail, NHWadood, ARahim, F Synthesis, molecular docking studies of hybrid benzimidazole as a-glucosidase inhibitor. Bioorg Chem70:184-191 (2017) 
 
Oligo-1,6-glucosidase IMA1
Name:Oligo-1,6-glucosidase IMA1
Type:Protein
Mol. Mass.:68577.59
Organism:Saccharomyces cerevisiae S288c (Baker's yeast)
Description:n/a
Residue:589
BDBM222072
NameBDBM222072
Synonyms:2-(4-(5,6-Dimethyl-1H-benzo[d]imidazol-2-yl)benzoyl)-N-(4-methoxyphenyl)hydrazinecarbothioamide (13)
TypeSmall organic molecule
Emp. Form.C24H23N5O2S
Mol. Mass.445.537
SMILESCOc1ccc(NC(=S)NNC(=O)c2ccc(cc2)-c2nc3cc(C)c(C)cc3[nH]2)cc1