Reaction Details
TargetChymotrypsinogen A
LigandBDBM50077011
Substrate/Competitorn/a
Meas. Tech.α-Chymotrypsin Inhibition Kinetic Assay
Ki 8.7e+3± 2.6e+3 nM
Citation Marasini, BPRahim, FPerveen, SKarim, AMohammed Khan, KAtta-Ur-Rahman, nullChoudhary, MI Synthesis, structure-activity relationships studies of benzoxazinone derivatives as a-chymotrypsin inhibitors. Bioorg Chem70:210-221 (2017) 
 
Chymotrypsinogen A
Name:Chymotrypsinogen A
Type:Serine protease
Mol. Mass.:25670.88
Organism:Bos taurus (bovine)
Description:n/a
Residue:245
BDBM50077011
NameBDBM50077011
Synonyms:2-Phenyl-4H-3,1-benzoxazin-4-one (3) CHEMBL24449
TypeSmall organic molecule
Emp. Form.C14H9NO2
Mol. Mass.223.2268
SMILESO=c1oc(nc2ccccc12)-c1ccccc1