Reaction Details
TargetChymotrypsinogen A
LigandBDBM222125
Substrate/Competitorn/a
Meas. Tech.α-Chymotrypsin Inhibition Kinetic Assay
Ki 2.26e+4± 3.1e+3 nM
Citation Marasini, BPRahim, FPerveen, SKarim, AMohammed Khan, KAtta-Ur-Rahman, nullChoudhary, MI Synthesis, structure-activity relationships studies of benzoxazinone derivatives as a-chymotrypsin inhibitors. Bioorg Chem70:210-221 (2017) 
 
Chymotrypsinogen A
Name:Chymotrypsinogen A
Type:Serine protease
Mol. Mass.:25670.88
Organism:Bos taurus (bovine)
Description:n/a
Residue:245
BDBM222125
NameBDBM222125
Synonyms:2-(3-Chlorophenyl)-4H-3,1-benzoxazin-4-one (14)
TypeSmall organic molecule
Emp. Form.C14H8ClNO2
Mol. Mass.257.672
SMILESClc1cccc(c1)-c1nc2ccccc2c(=O)o1