Reaction Details
TargetChymotrypsinogen A
LigandBDBM222139
Substrate/Competitorn/a
Meas. Tech.α-Chymotrypsin Inhibition Kinetic Assay
Ki 2.6e+3± 2e+2 nM
Citation Marasini, BPRahim, FPerveen, SKarim, AMohammed Khan, KAtta-Ur-Rahman, nullChoudhary, MI Synthesis, structure-activity relationships studies of benzoxazinone derivatives as a-chymotrypsin inhibitors. Bioorg Chem70:210-221 (2017) 
 
Chymotrypsinogen A
Name:Chymotrypsinogen A
Type:Serine protease
Mol. Mass.:25670.88
Organism:Bos taurus (bovine)
Description:n/a
Residue:245
BDBM222139
NameBDBM222139
Synonyms:Chymostatin | US11859014, Compound chymostatin
TypeSmall organic molecule
Emp. Form.C31H41N7O6
Mol. Mass.607.7005
SMILESCC(C)C[C@H](NC(=O)[C@@H](NC(=O)N[C@@H](Cc1ccccc1)C(O)=O)C1CCN=C(N)N1)C(=O)N[C@@H](Cc1ccccc1)C=O