Reaction Details
TargetOligo-1,6-glucosidase IMA1
LigandBDBM222212
Substrate/Competitorn/a
Meas. Tech.α-Glucosidase Inhibition Assay
IC50 2.223e+4± 2e+1 nM
Citation Chaudhry, FNaureen, SHuma, RShaukat, AAl-Rashida, MAsif, NAshraf, MMunawar, MAKhan, MA In search of new a-glucosidase inhibitors: Imidazolylpyrazole derivatives. Bioorg Chem71:102-109 (2017) 
 
Oligo-1,6-glucosidase IMA1
Name:Oligo-1,6-glucosidase IMA1
Type:Protein
Mol. Mass.:68577.59
Organism:Saccharomyces cerevisiae S288c (Baker's yeast)
Description:n/a
Residue:589
BDBM222212
NameBDBM222212
Synonyms:4-(4,5-Diphenyl-1H-imidazol-2-yl)-1,3-diphenyl-1H-pyrazole (2a)
TypeSmall organic molecule
Emp. Form.C30H22N4
Mol. Mass.438.5225
SMILESc1c(-c2nc(c([nH]2)-c2ccccc2)-c2ccccc2)c(nn1-c1ccccc1)-c1ccccc1