Reaction Details
TargetSeed linoleate 13S-lipoxygenase-1
LigandBDBM222268
Substrate/Competitorn/a
Meas. Tech.In Vitro Soybean Lipoxygenase (SLO) Inhibition Assay
pH8±n/a
IC50 7.85e+4± 5.0 nM
Commentsextracted
Citation Vinayagam, JGajbhiye, RLMandal, LArumugam, MAchari, AJaisankar, P Substituted furans as potent lipoxygenase inhibitors: Synthesis, in vitro and molecular docking studies. Bioorg Chem71:97-101 (2017) 
 
Seed linoleate 13S-lipoxygenase-1
Name:Seed linoleate 13S-lipoxygenase-1
Type:Enzyme
Mol. Mass.:94365.66
Organism:Glycine max (soybean)
Description:n/a
Residue:839
BDBM222268
NameBDBM222268
Synonyms:2-Methyl-4-(2-oxo-2-phenyl-ethyl)-5-phenyl-furan-3-carboxylic acid methyl ester (3a)
TypeSmall organic molecule
Emp. Form.C21H18O4
Mol. Mass.334.3652
SMILESCOC(=O)c1c(C)oc(c1CC(=O)c1ccccc1)-c1ccccc1