Reaction Details
TargetSeed linoleate 13S-lipoxygenase-1
LigandBDBM222270
Substrate/Competitorn/a
Meas. Tech.In Vitro Soybean Lipoxygenase (SLO) Inhibition Assay
pH8±n/a
IC50 2.21e+4± 4.1 nM
Commentsextracted
Citation Vinayagam, JGajbhiye, RLMandal, LArumugam, MAchari, AJaisankar, P Substituted furans as potent lipoxygenase inhibitors: Synthesis, in vitro and molecular docking studies. Bioorg Chem71:97-101 (2017) 
 
Seed linoleate 13S-lipoxygenase-1
Name:Seed linoleate 13S-lipoxygenase-1
Type:Enzyme
Mol. Mass.:94365.66
Organism:Glycine max (soybean)
Description:n/a
Residue:839
BDBM222270
NameBDBM222270
Synonyms:Methyl 2-methyl-5-(4-methylphenyl)-4-[2-(4-methylphenyl)-2-oxoethyl]furan-3-carboxylate (3c)
TypeSmall organic molecule
Emp. Form.C23H22O4
Mol. Mass.362.4184
SMILESCOC(=O)c1c(C)oc(c1CC(=O)c1ccc(C)cc1)-c1ccc(C)cc1