Reaction Details
TargetSeed linoleate 13S-lipoxygenase-1
LigandBDBM222271
Substrate/Competitorn/a
Meas. Tech.In Vitro Soybean Lipoxygenase (SLO) Inhibition Assay
pH8±n/a
IC50 2.26e+4± 3.0 nM
Commentsextracted
Citation Vinayagam, JGajbhiye, RLMandal, LArumugam, MAchari, AJaisankar, P Substituted furans as potent lipoxygenase inhibitors: Synthesis, in vitro and molecular docking studies. Bioorg Chem71:97-101 (2017) 
 
Seed linoleate 13S-lipoxygenase-1
Name:Seed linoleate 13S-lipoxygenase-1
Type:Enzyme
Mol. Mass.:94365.66
Organism:Glycine max (soybean)
Description:n/a
Residue:839
BDBM222271
NameBDBM222271
Synonyms:2-Methyl-4-(2-oxo-2-p-tolyl-ethyl)-5-p-tolyl-furan-3-carboxylic acid ethyl ester (3d)
TypeSmall organic molecule
Emp. Form.C24H24O4
Mol. Mass.376.445
SMILESCCOC(=O)c1c(C)oc(c1CC(=O)c1ccc(C)cc1)-c1ccc(C)cc1