Reaction Details
TargetSeed linoleate 13S-lipoxygenase-1
LigandBDBM222272
Substrate/Competitorn/a
Meas. Tech.In Vitro Soybean Lipoxygenase (SLO) Inhibition Assay
pH8±n/a
IC50 1.28e+4± 0.8 nM
Commentsextracted
Citation Vinayagam, JGajbhiye, RLMandal, LArumugam, MAchari, AJaisankar, P Substituted furans as potent lipoxygenase inhibitors: Synthesis, in vitro and molecular docking studies. Bioorg Chem71:97-101 (2017) 
 
Seed linoleate 13S-lipoxygenase-1
Name:Seed linoleate 13S-lipoxygenase-1
Type:Enzyme
Mol. Mass.:94365.66
Organism:Glycine max (soybean)
Description:n/a
Residue:839
BDBM222272
NameBDBM222272
Synonyms:5-(4-Bromo-phenyl)-4[2-(4-bromo-phenyl)-2-oxo-ethyl]-2-methyl-furan-3-carboxylic acid methyl ester (3e)
TypeSmall organic molecule
Emp. Form.C21H16Br2O4
Mol. Mass.492.157
SMILESCOC(=O)c1c(C)oc(c1CC(=O)c1ccc(Br)cc1)-c1ccc(Br)cc1