Reaction Details
TargetSeed linoleate 13S-lipoxygenase-1
LigandBDBM222274
Substrate/Competitorn/a
Meas. Tech.In Vitro Soybean Lipoxygenase (SLO) Inhibition Assay
pH8±n/a
IC50 3.25e+4± 1.8 nM
Commentsextracted
Citation Vinayagam, JGajbhiye, RLMandal, LArumugam, MAchari, AJaisankar, P Substituted furans as potent lipoxygenase inhibitors: Synthesis, in vitro and molecular docking studies. Bioorg Chem71:97-101 (2017) 
 
Seed linoleate 13S-lipoxygenase-1
Name:Seed linoleate 13S-lipoxygenase-1
Type:Enzyme
Mol. Mass.:94365.66
Organism:Glycine max (soybean)
Description:n/a
Residue:839
BDBM222274
NameBDBM222274
Synonyms:5-(4-Chloro-phenyl)-4[2-(4-chloro-phenyl)-2-oxo-ethyl]-2-methyl-furan-3-carboxylic acid methyl ester (3g)
TypeSmall organic molecule
Emp. Form.C21H16Cl2O4
Mol. Mass.403.255
SMILESCOC(=O)c1c(C)oc(c1CC(=O)c1ccc(Cl)cc1)-c1ccc(Cl)cc1