Reaction Details
TargetSeed linoleate 13S-lipoxygenase-1
LigandBDBM222277
Substrate/Competitorn/a
Meas. Tech.In Vitro Soybean Lipoxygenase (SLO) Inhibition Assay
pH8±n/a
IC50 4.75e+4± 0.1 nM
Commentsextracted
Citation Vinayagam, JGajbhiye, RLMandal, LArumugam, MAchari, AJaisankar, P Substituted furans as potent lipoxygenase inhibitors: Synthesis, in vitro and molecular docking studies. Bioorg Chem71:97-101 (2017) 
 
Seed linoleate 13S-lipoxygenase-1
Name:Seed linoleate 13S-lipoxygenase-1
Type:Enzyme
Mol. Mass.:94365.66
Organism:Glycine max (soybean)
Description:n/a
Residue:839
BDBM222277
NameBDBM222277
Synonyms:5-(3-Chloro-4-methyl-phenyl)-4-[2-(3-chloro-4-methyl-phenyl)-2-oxo-ethyl)-2-methyl-furan-3-carboxylic acid methyl ester (3i)
TypeSmall organic molecule
Emp. Form.C23H20Cl2O4
Mol. Mass.431.309
SMILESCOC(=O)c1c(C)oc(c1CC(=O)c1ccc(C)c(Cl)c1)-c1ccc(C)c(Cl)c1