Reaction Details
TargetLysophosphatidic acid receptor 1
LigandBDBM251728
Substrate/Competitorn/a
Meas. Tech.In Vitro LPA1 Receptor Assay
Temperature298.15±n/a K
IC50 9.00±n/a nM
Commentsextracted
Citation Buffham, WCanning, HDavenport, RFarnaby, WMack, SParmar, AWright, S Amide derivatives as lysophosphatidic acid receptor antagonists US Patent US10100018 Publication Date 10/16/2018
 
Lysophosphatidic acid receptor 1
Name:Lysophosphatidic acid receptor 1
Type:Enzyme
Mol. Mass.:41120.55
Organism:Homo sapiens (Human)
Description:Q92633
Residue:364
BDBM251728
NameBDBM251728
Synonyms:US10100018, Example 64 | US9464060, 64
TypeSmall organic molecule
Emp. Form.C25H22F3NO5
Mol. Mass.473.4411
SMILESCOc1ccccc1Oc1ccc(cc1)C(=O)N(CCC(F)(F)F)Cc1ccc(cc1)C(O)=O