Reaction Details
TargetCarbonic anhydrase 2
LigandBDBM222428
Substrate/Competitorn/a
Meas. Tech.Carbonic Anhydrase II Inhibition Assay
pH7.4±n/a
Temperature298.15±n/a K
IC50 1.33e+3± 1e+1 nM
Commentsextracted
Citation Iqbal, SSaleem, MAzim, MKTaha, MSalar, UKhan, KMPerveen, SChoudhary, MI Carbohydrazones as new class of carbonic anhydrase inhibitors: Synthesis, kinetics, and ligand docking studies. Bioorg Chem72:89-101 (2017) 
 
Carbonic anhydrase 2
Name:Carbonic anhydrase 2
Type:Enzyme Catalytic Domain
Mol. Mass.:29115.93
Organism:Bos taurus
Description:n/a
Residue:260
BDBM222428
NameBDBM222428
Synonyms:N'',N'''-Bis[(E)-(4-nitrophenyl)methylidene]carbonic dihydrazide (1)
TypeSmall organic molecule
Emp. Form.C15H12N6O5
Mol. Mass.356.293
SMILES[O-][N+](=O)c1ccc(\C=N\NC(=O)N\N=C\c2ccc(cc2)[N+]([O-])=O)cc1