Reaction Details
TargetCarbonic anhydrase 2
LigandBDBM222435
Substrate/Competitorn/a
Meas. Tech.Carbonic Anhydrase II Inhibition Assay
pH7.4±n/a
Temperature298.15±n/a K
IC50 1.46e+3± 1.2e+2 nM
Commentsextracted
Citation Iqbal, SSaleem, MAzim, MKTaha, MSalar, UKhan, KMPerveen, SChoudhary, MI Carbohydrazones as new class of carbonic anhydrase inhibitors: Synthesis, kinetics, and ligand docking studies. Bioorg Chem72:89-101 (2017) 
 
Carbonic anhydrase 2
Name:Carbonic anhydrase 2
Type:Enzyme Catalytic Domain
Mol. Mass.:29115.93
Organism:Bos taurus
Description:n/a
Residue:260
BDBM222435
NameBDBM222435
Synonyms:N'',N'''-Bis[(E)-(2,6-dichlorophenyl)methylidene]carbonic dihydrazide (9)
TypeSmall organic molecule
Emp. Form.C15H10Cl4N4O
Mol. Mass.404.078
SMILESClc1cccc(Cl)c1\C=N\NC(=O)N\N=C\c1c(Cl)cccc1Cl