Reaction Details
TargetCarbonic anhydrase 2
LigandBDBM222431
Substrate/Competitorn/a
Meas. Tech.Carbonic Anhydrase II Kinetic Assay
pH7.4±n/a
Ki 2.52e+3±n/a nM
Commentsextracted
Citation Iqbal, SSaleem, MAzim, MKTaha, MSalar, UKhan, KMPerveen, SChoudhary, MI Carbohydrazones as new class of carbonic anhydrase inhibitors: Synthesis, kinetics, and ligand docking studies. Bioorg Chem72:89-101 (2017) 
 
Carbonic anhydrase 2
Name:Carbonic anhydrase 2
Type:Enzyme Catalytic Domain
Mol. Mass.:29115.93
Organism:Bos taurus
Description:n/a
Residue:260
BDBM222431
NameBDBM222431
Synonyms:N'',N'''-Bis[(E)-(4-bromophenyl)methylidene]carbonic dihydrazide (4)
TypeSmall organic molecule
Emp. Form.C15H12Br2N4O
Mol. Mass.424.09
SMILESBrc1ccc(\C=N\NC(=O)N\N=C\c2ccc(Br)cc2)cc1