Reaction Details
TargetPeroxisome proliferator-activated receptor gamma [182-505]/Regulatory protein GAL4 [1-147]
LigandBDBM222689
Substrate/Competitorn/a
Meas. Tech.Activation Assay
EC50 450±n/a nM
Citation Miura, TSato, SYamada, HTagashira, JWatanabe, TSekimoto, RIshida, RAoki, HOhgiya, T Phenylpyridine derivative and drug containing same US Patent US9315493 Publication Date 4/19/2016
 
Peroxisome proliferator-activated receptor gamma [182-505]/Regulatory protein GAL4 [1-147]
Name:Peroxisome proliferator-activated receptor gamma [182-505]/Regulatory protein GAL4 [1-147]
Synonyms:PPARgamma2 - DNA binding domain of Gal4
Type:DNA-Protein
Mol. Mass.:n/a
Description:n/a
Components:This complex has 2 components.
Component 1
Name:Regulatory protein GAL4 [1-147]
Type:DNA Binding
Mol. Mass.:16874.50
Organism:Saccharomyces bayanus (Yeast)
Description:amino acids 1 to 147
Residue:147
Component 2
Name:Peroxisome proliferator-activated receptor gamma [182-505]
Synonyms:NR1C3 PPARG_HUMAN | Peroxisome proliferator-activated receptor gamma (PPAR-gamma)
Type:Protein
Mol. Mass.:37077.80
Organism:Homo sapiens (Human)
Description:amino acids 182 to 505
Residue:324
BDBM222689
NameBDBM222689
Synonyms:US9315493, 21
TypeSmall organic molecule
Emp. Form.C31H33N7O4
Mol. Mass.567.6382
SMILESCCCCc1nc(C(C)C)n(-c2ncc(OCC)cn2)c(=O)c1Cc1ccc(nc1)-c1ccccc1-c1noc(=O)[nH]1