Reaction Details
TargetMetabotropic glutamate receptor 2
LigandBDBM222972
Substrate/Competitorn/a
Meas. Tech.[35S]-GTPγS Assay
EC50 9.08±n/a nM
Citation Fiji, HDKelly, III, MJKern, JCLayton, MEPero, JEReif, AJRossi, MA Imidazopyridin-2-one derivatives US Patent US9315518 Publication Date 4/19/2016
 
Metabotropic glutamate receptor 2
Name:Metabotropic glutamate receptor 2
Type:Enzyme
Mol. Mass.:95584.88
Organism:Homo sapiens (Human)
Description:Q14416
Residue:872
BDBM222972
NameBDBM222972
Synonyms:US9315518, 2-7 | US9315518, 5-2
TypeSmall organic molecule
Emp. Form.C23H27N5O3
Mol. Mass.421.4922
SMILESCn1c2nc(ccc2n(CC(C)(C)C)c1=O)C1=CC2CCC1CN2C(=O)c1ccon1