Reaction Details
TargetMetabotropic glutamate receptor 2
LigandBDBM222967
Substrate/Competitorn/a
Meas. Tech.[35S]-GTPγS Assay
EC50 69.3±n/a nM
Citation Fiji, HDKelly, III, MJKern, JCLayton, MEPero, JEReif, AJRossi, MA Imidazopyridin-2-one derivatives US Patent US9315518 Publication Date 4/19/2016
 
Metabotropic glutamate receptor 2
Name:Metabotropic glutamate receptor 2
Type:Enzyme
Mol. Mass.:95584.88
Organism:Homo sapiens (Human)
Description:Q14416
Residue:872
BDBM222967
NameBDBM222967
Synonyms:US9315518, 2-8
TypeSmall organic molecule
Emp. Form.C22H26N6O2S
Mol. Mass.438.546
SMILESCn1c2nc(ccc2n(CC(C)(C)C)c1=O)C1=CC2CCC1CN2C(=O)c1csnn1