Reaction Details
TargetEpithelial discoidin domain-containing receptor 1
LigandBDBM223099
Substrate/Competitorn/a
Meas. Tech.LanthaScreen Eu Kinase Activity Assay
pH7.5±n/a
Temperature298.15±n/a K
IC50 12.1±6.3 nM
Commentsextracted
Citation Liu, LHussain, MLuo, JDuan, AChen, CTu, ZZhang, J Synthesis and biological evaluation of novel dasatinib analogues as potent DDR1 and DDR2 kinase inhibitors. Chem Biol Drug Des89:420-427 (2017) 
 
Epithelial discoidin domain-containing receptor 1
Name:Epithelial discoidin domain-containing receptor 1
Type:Tyrosine-protein kinase
Mol. Mass.:101130.02
Organism:Homo sapiens (Human)
Description:Q08345
Residue:913
BDBM223099
NameBDBM223099
Synonyms:Isobutyl 3-(6-((5-((2-chloro-6-methylphenyl)carbamoyl)thiazol-2-yl)amino)-2-methylpyrimidin-4-yl)pyrrolidine-1-carboxylate (5f)
TypeSmall organic molecule
Emp. Form.C25H29ClN6O3S
Mol. Mass.529.054
SMILESCC(C)COC(=O)N1CCC(C1)c1cc(Nc2ncc(s2)C(=O)Nc2c(C)cccc2Cl)nc(C)n1