Reaction Details
TargetTyrosine-protein kinase ABL1
LigandBDBM223083
Substrate/Competitorn/a
Meas. Tech.FRET-Based Z'-Lyte Assay
pH7.5±n/a
Temperature298.15±n/a K
IC50 0.241±0.118 nM
Commentsextracted
Citation Liu, LHussain, MLuo, JDuan, AChen, CTu, ZZhang, J Synthesis and biological evaluation of novel dasatinib analogues as potent DDR1 and DDR2 kinase inhibitors. Chem Biol Drug Des89:420-427 (2017) 
 
Tyrosine-protein kinase ABL1
Name:Tyrosine-protein kinase ABL1
Type:Enzyme
Mol. Mass.:122897.30
Organism:Homo sapiens (Human)
Description:P00519
Residue:1130
BDBM223083
NameBDBM223083
Synonyms:Isopropyl 4-(6-((5-((2-chloro-6-methylphenyl)carbamoyl)thiazol-2-yl)amino)-2-methylpyrimidin-4-yl)-piperazine-1-carboxylate (3c)
TypeSmall organic molecule
Emp. Form.C24H28ClN7O3S
Mol. Mass.530.042
SMILESCC(C)OC(=O)N1CCN(CC1)c1cc(Nc2ncc(s2)C(=O)Nc2c(C)cccc2Cl)nc(C)n1