Reaction Details
TargetTyrosine-protein kinase ABL1
LigandBDBM223104
Substrate/Competitorn/a
Meas. Tech.FRET-Based Z'-Lyte Assay
pH7.5±n/a
Temperature298.15±n/a K
IC50 0.205±0.062 nM
Commentsextracted
Citation Liu, LHussain, MLuo, JDuan, AChen, CTu, ZZhang, J Synthesis and biological evaluation of novel dasatinib analogues as potent DDR1 and DDR2 kinase inhibitors. Chem Biol Drug Des89:420-427 (2017) 
 
Tyrosine-protein kinase ABL1
Name:Tyrosine-protein kinase ABL1
Type:Enzyme
Mol. Mass.:122897.30
Organism:Homo sapiens (Human)
Description:P00519
Residue:1130
BDBM223104
NameBDBM223104
Synonyms:2-((6-((1-Acryloylpyrrolidin-3-yl)amino)-2-methylpyrimidin-4-yl)amino)-N-(2-chloro-6-methylphenyl)thiazole-5-carboxamide (5k)
TypeSmall organic molecule
Emp. Form.C23H24ClN7O2S
Mol. Mass.498
SMILESCc1nc(NC2CCN(C2)C(=O)C=C)cc(Nc2ncc(s2)C(=O)Nc2c(C)cccc2Cl)n1