Reaction Details
TargetLeukotriene C4 synthase
LigandBDBM223237
Substrate/CompetitorLTC4
Meas. Tech.In Vitro hLTC4 Synthase Enzyme Assay (Test A)
pH7.8±n/a
IC50 28±n/a nM
Commentsextracted
Citation Ronn, RLindh, CJRingberg, EAndersson, HBNilsson, PSchaal, WRRosenschold, MMNikitidis, ANikitidis, GJohannesson, PTyrcha, C Compounds and uses  US Patent US20160326143 Publication Date 11/10/2016
 
Leukotriene C4 synthase
Name:Leukotriene C4 synthase
Type:PROTEIN
Mol. Mass.:16575.59
Organism:Homo sapiens (Human)
Description:ChEMBL_961179
Residue:150
BDBM223237
LTC4
NameBDBM223237
Synonyms:2-(5-((Cyclopropylmethyl)(naphthalen-2-yl)amino)-3-methoxypicolinoyl)cyclopropanecarboxylic acid US9657001, 12
TypeSmall Organic Molecule
Emp. Form.C25H24N2O4
Mol. Mass.416.4691
SMILESCOc1cc(cnc1C(=O)C1CC1C(O)=O)N(CC1CC1)c1ccc2ccccc2c1