Reaction Details
TargetLeukotriene C4 synthase
LigandBDBM223273
Substrate/CompetitorLTC4
Meas. Tech.In Vitro hLTC4 Synthase Enzyme Assay (Test A)
pH7.8±n/a
IC50 46±n/a nM
Commentsextracted
Citation Ronn, RLindh, CJRingberg, EAndersson, HBNilsson, PSchaal, WRRosenschold, MMNikitidis, ANikitidis, GJohannesson, PTyrcha, C Compounds and uses  US Patent US20160326143 Publication Date 11/10/2016
 
Leukotriene C4 synthase
Name:Leukotriene C4 synthase
Type:PROTEIN
Mol. Mass.:16575.59
Organism:Homo sapiens (Human)
Description:ChEMBL_961179
Residue:150
BDBM223273
LTC4
NameBDBM223273
Synonyms:2-(4-((Cyclopropylmethyl)(naphthalen-1-yl)amino)-2-methoxybenzoyl)cyclopropanecarboxylic acid US9657001, 48
TypeSmall Organic Molecule
Emp. Form.C26H25NO4
Mol. Mass.415.481
SMILESCOc1cc(ccc1C(=O)C1CC1C(O)=O)N(CC1CC1)c1cccc2ccccc12