Reaction Details
TargetLeukotriene C4 synthase
LigandBDBM223288
Substrate/CompetitorLTC4
Meas. Tech.In Vitro hLTC4 Synthase Enzyme Assay (Test B)
pH7.5±n/a
IC50 0.248±n/a nM
Commentsextracted
Citation Ronn, RLindh, CJRingberg, EAndersson, HBNilsson, PSchaal, WRRosenschold, MMNikitidis, ANikitidis, GJohannesson, PTyrcha, C Compounds and uses  US Patent US20160326143 Publication Date 11/10/2016
 
Leukotriene C4 synthase
Name:Leukotriene C4 synthase
Type:PROTEIN
Mol. Mass.:16575.59
Organism:Homo sapiens (Human)
Description:ChEMBL_961179
Residue:150
BDBM223288
LTC4
NameBDBM223288
Synonyms:(1S,2S)-2-[(5-{(2-Fluoro-2-methylpropyl)[2-fluoro-5-(trifluoromethyl)phenyl]amino}-3-methoxypyrazin-2-yl)carbonyl]cyclopropanecarboxylic acid US9657001, 63
TypeSmall Organic Molecule
Emp. Form.C21H20F5N3O4
Mol. Mass.473.3932
SMILESCOc1nc(cnc1C(=O)[C@H]1C[C@@H]1C(O)=O)N(CC(C)(C)F)c1cc(ccc1F)C(F)(F)F