Reaction Details
TargetCaspase-5
LigandBDBM50240374
Substrate/Competitorn/a
Meas. Tech.Caspase Catalytic Activity Assay
pH7.4±n/a
IC50 8.7e+2± 9e+1 nM
Commentsextracted
Citation Smith, CESoti, SJones, TANakagawa, AXue, DYin, H Non-steroidal Anti-inflammatory Drugs Are Caspase Inhibitors. Cell Chem Biol24:281-292 (2017) 
 
Caspase-5
Name:Caspase-5
Type:Enzyme
Mol. Mass.:49760.80
Organism:Homo sapiens (Human)
Description:P51878
Residue:434
BDBM50240374
NameBDBM50240374
Synonyms:3-(4-biphenylylcarbonyl)propionic acid 4-(4-biphenylyl)-4-oxobutyric acid 4-biphenyl-4-yl-4-oxobutanoic acid Fenbufen | gamma-oxo(1,1'-biphenyl)-4-butanoic acid
TypeSmall organic molecule
Emp. Form.C16H14O3
Mol. Mass.254.2806
SMILESOC(=O)CCC(=O)c1ccc(cc1)-c1ccccc1