Reaction Details
TargetRAC-alpha serine/threonine-protein kinase [1-123]
LigandBDBM223480
Substrate/Competitorn/a
Meas. Tech.SPR Competitive Binding Assay
Ki 260±n/a nM
Citation Mahadevan, DMeuillet, EJMash, Jr., EAGokhale, VMPowis, GZhang, S Small molecule inhibitors of the pleckstrin homology domain and methods for using same US Patent US9320734 Publication Date 4/26/2016
 
RAC-alpha serine/threonine-protein kinase [1-123]
Name:RAC-alpha serine/threonine-protein kinase [1-123]
Type:Enzyme
Mol. Mass.:14664.42
Organism:Homo sapiens (Human)
Description:PLECKSTRIN HOMOLOGY DOMAIN RESIDUES 1-123 (PH Domain)
Residue:123
BDBM223480
NameBDBM223480
Synonyms:US9320734, PtdIns(3,4,5)trisphosphate
TypeSmall organic molecule
Emp. Form.C41H75O22P4
Mol. Mass.1043.9199
(=O)OCC(COP([O-])(=O)OC1[C@H](O)[C@H](OP([O-])([O-])=O)C(OP([O-])([O-])=O)[C@H](OP([O-])([O-])=O)[C@H]1O)OC(=O)CCCCCCCCCCCCCCC